1 Introduction
1.1 Simple Examples
1.2 Exceptions
1.3 Multiple Values
1.4 Custom Value Checks
1.5 Output Ports
1.6 Test Sections
1.7 Expected Failures
1.8 Intermixed Racket Code
2 Interface
3 Deprecated
4 Known Issues
5 History
6 Legal
Version: 3:1

Overeasy: Racket Language Test Engine

Neil Van Dyke

 (require (planet neil/overeasy:3:1))

1 Introduction

Overeasy is a software test engine for the Racket programming language. It designed for all of:
  • interspersing unit tests in-line with implementation code, using the Racket test submodule, or in separate files;

  • unit testing of individual modules, either from within DrRacket, or from the command line or Emacs;

  • rapid interactive testing of expressions in the REPL; and

  • running hierarchical sets of individual module unit tests at once.

An individual test case, or test, is specified by the programmer with the test syntax, and evaluation of that syntax causes the test to be run. Properties that are checked by tests are:
  • values of expressions (single value, or multiple value);

  • exceptions raised; and

  • output to current-output-port and current-error-port.

Tests can also be marked as expected to fail. Tests can be organized into hierarchically-nested sections.
Some checking is also done to help protect test suites from crashing due to errors in the setup of the test itself, such as errors in evaluating an expression that provides an expected value for a test.

1.1 Simple Examples

Here’s a simple test, with the first argument the expression under test, and the other argument the expected value.

> (test (+ 1 2 3) 6)

How the results of tests are reported varies depending on how the tests are run. For purposes of these examples, we will pretend we are running tests in the simplest way. In this way, tests that fail produce one-line error-messages to current-error-port, which in DrRacket show up as red italic text by default. Tests that pass in this way do not produce any message at all. So, our first example above, does not produce any message.
Now, for a test that fails:

> (test (+ 1 2 3) 7)

TEST FAILED [???] Value 6 did not match expected value 7 by equal?.

That’s a quick way to do a test in a REPL or when you’re otherwise in a hurry, but if you’re reviewing a report of failed tests for one or more modules, you’d probably like a more descriptive way of seeing which tests failed. That’s what the test ID is for, and to specify it, we use the #:id keyword arguments in our test:
> (test #:id 'simple-addition
        (+ 1 2 3)

TEST FAILED [simple-addition] Value 6 did not match expected value 7 by equal?.

Quick note on syntax. The above is actually shorthand syntax. In the non-shorthand syntax, every argument to test has a keyword, so the above is actually shorthand for:
(test #:id   'simple-addition
      #:code (+ 1 2 3)
      #:val  7)
#:code and #:val are used so often that the keywords can be left off, so long as there are no other keyword arguments before them, other than #:id.
You can even leave off the #:id keyword, so long as you have both code and val expressions, also without keywords. So, the above example has equivalent shorthand:
(test 'simple-addition
      (+ 1 2 3)
In the rest of these examples, we’ll use the shorthand syntax, because it’s quicker to type, and getting rid of the #:code and #:val keywords also makes less-common keyword arguments stand out.

1.2 Exceptions

So far, we’ve been checking the values of code, and we haven’t yet dealt in exceptions. Exceptions, such as due to programming errors in the code being tested, can also be reported:
> (test (+ 1 (error "help!") 3)

TEST FAILED [???] Got exception #(struct:exn:fail "help!"), but expected value 3.

And if an exception is the correct behavior, instead of specifying an expected value, we can use #:exn to specify predicate just like for with-handlers:
> (test (+ 1 (error "help!") 3)
        #:exn exn:fail?)
That test passed. But if our code under test doesn’t throw an exception matched by our #:exn predicate, that’s a test failure:
> (test (+ 1 2 3)
        #:exn exn:fail?)

TEST FAILED [???] Got value 6, but expected exception matched by predicate exn:fail?.

Of course, when you want finer discrimination of exceptions than, say,exn:fail? or exn:fail:filesystem?, you can write a custom predicate that uses exn-message or other information, and supply it to test’s #:exn.

1.3 Multiple Values

Multiple values are supported:
> (test (begin 1 2 3)
        (values 1 2 3))

TEST FAILED [???] Value 3 did not match expected values (1 2 3) by equal?.

1.4 Custom Value Checks

You might have noticed that a lot of the test failure messages say “by equal?”. That’s referring to the default predicate, so, the following test passes:
> (test (string-append "a" "b" "c")
But we let’s say we wanted the expected and actual values to not necessarily be equal? but to be numbers within 3 decimal places of being equal:
> (define (close-enough-val-check a-values b-values)
    (and (null? (cdr a-values))
         (null? (cdr b-values))
         (let ((a (car a-values))
               (b (car b-values)))
           (and (number? a)
                (number? b)
                (equal? (round (* 1000 a))
                        (round (* 1000 b)))))))
> (test 3.142
        #:val-check close-enough-val-check)
Note that, since expressions can produce multiple values, the #:val-check predicate receives lists of values instead of single values.
As mentioned earlier, the checker does not have to be an equality predicate, and it can use whatever reasoning you like in rendering its verdict on whether the actual value should be considered OK.

1.5 Output Ports

In addition to values and exceptions, test also intercepts and permits checking of current-output-port and current-error-port. By default, it assumes no output to either of those ports, which is especially good for catching programming errors like neglecting to specify an output port to a procedure for which the port is optional:
> (test (let ((o (open-output-string)))
          (display 'a o) (display 'b) (display 'c o)
          (get-output-string o))

TEST FAILED [???] Value "ac" did not match expected value "abc" by equal?. Out bytes #"b" did not match expected #"" by equal?.

Likewise, messages to current-error-port, such as warnings and errors from legacy code, are also caught by default:
> (test (begin (fprintf (current-error-port)

TEST FAILED [???] Value 0 did not match expected value 42 by equal?. Err bytes #"%W%SYS$FROBINATOR_OVERHEAT\n" did not match expected #"" by equal?.

Now we know why we’ve started getting 0, which information might have gone unnoticed had our test engine not captured error port output: the frobinator is failing, after all these years of valiant service.
With the #:out-check and #:err-check keyword arguments to test, you can specify predicates other than equal?. Also, by setting one of these predicates to #f, you can cause the output to be consumed but not stored and checked. This is useful if, for example, the code produces large amounts of debugging message output.
> (test (begin (display "blah")
               (display "blah")
               (display "blah")
               (* 44 2))
        #:out-check #f)

1.6 Test Sections

Sequences of tests can be nested in a test section, and the test section given an ID. Test sections can be nested within each other.
For example:
> (test-section 'fundamentals
    (test-section 'writing
      (test 'abcs
            (string-append "a" "b" "c")
    (test-section 'arithmetic
      (test 'one-two-three
            (+ 1 2 3)
      (test 'for-fife-sax
            (+ 4 5 6)

TEST FAILED [fundamentals arithmetic for-fife-sax] Value 15 did not match expected value 666 by equal?.

Note that the reference to test ID for-fife-sax in the error message is qualified with the path through the test sections: section fundamentals and its child section, arithmetic. In large test suites, this can help to locate the test.
Note that a given instance test-section syntax appear inside procedures and loops. This can be very useful for testing code with different arguments or context, when the behavior is the same or similar for many of the combinations. When doing this, note that a test-section ID need not be a constant symbol like 'for-fife-sax, but can also be a Racket expression, so it could be used to indicate one or more of the arguments. For example, suppose that there is a case for three-argument procedure foo in which, if the third argument is 0, the answer should be 42:
> (test-section 'foo-constant-with-z-arg-zero
    (for ((bar? (in-list '(#true #false))))
      (test-section bar?
        (for ((power (in-range 1 9)))
          (test #:id   power
                #:code (foo bar? power 0)
                #:val  42)))))
When this test code is run, Racket logger entries starting with the following should be made (and can be viewed in the DrRacket Log window, and elsewhere):

overeasy: Start Test Section [foo-constant-with-z-arg-zero]

overeasy: Start Test Section [foo-constant-with-z-arg-zero #t]

overeasy: Test Passed [foo-constant-with-z-arg-zero #t 1]

overeasy: Test Passed [foo-constant-with-z-arg-zero #t 2]

overeasy: Test Passed [foo-constant-with-z-arg-zero #t 3]

By the way, in the examples above, we have left out the optional #:id keyword from the test-section syntax. The following two forms are equivalent:

(test-section #:id 'math (test (+ 1 2) 3) ...)

(test-section 'math (test (+ 1 2) 3) ...)

1.7 Expected Failures

Sometimes, you’ll have a test case that is known to fail, but that you are deferring fixing, and that you don’t want distracting you from other test cases at this time. Rather than commenting-out the test case code, which might result in being lost or forgotten, you can instead mark the test case with #:fail. For example:
> (test 'basic-arithmetic
        (plussy 1 2 3)
        #:fail "bug til move to new library")
In this example, the string "bug til move to new library" gives the rationale for expecting the test to fail but deferring corrective action on it. When this test syntax is evaluated, instead of an exception being raised, instead a warning level message is sent to the Racket logger:

overeasy: Test Failed Expectedly [basic-arithmetic] Value 5.9 did not match expected value 6 by equal?. (#:fail "bug til move to new library")

Note that if (plussy 1 2 3) does produce the correct 6 value, but the #:fail argument is still present, then the test will actually be considered to fail:

TEST FAILED [basic-arithmetic] Passed unexpectedly. (#:fail "bug til move to new library")

1.8 Intermixed Racket Code

There are some more tricks you can do with test. Most notably, you’ll sometimes want to set up state in the system – Racket parameters, test input files, whatever. Because the test syntax can appear anywhere normal Racket code can, you can set up this state using normal Racket code. No special forms for setup and tear-down are required, nor are they provided.

2 Interface


(test-section maybe-id-kw id body ...+)

maybe-id-kw = 
  | #:id
See above.


(test !!!)

See above.

3 Deprecated


(with-test-usection maybe-id-kw id body ...+)

maybe-id-kw = 
  | #:id
Deprecated. Alias for test-section.

4 Known Issues

5 History

6 Legal

Copyright 2011–2012 Neil Van Dyke. This program is Free Software; Software; you can redistribute it and/or modify it under the terms of the GNU Lesser General Public License as published by the Free Software Foundation; either version 3 of the License, or (at your option) any later version. This program is distributed in the hope that it will be useful, but without any warranty; without even the implied warranty of merchantability or fitness for a particular purpose. See http://www.gnu.org/licenses/ for details. For other licenses and consulting, please contact the author.